DIAS
type: Concept
change note: 2022-04-18 13:24:43.0 [tstevens] insert AltLabel (id: null category: primary text: Direct Irradiance Airborne Spectrometer language code: en); insert Definition (id: null text: A solar tracking Direct beam Irradiance Airborne Spectrometer (DIAS) is used for calculation of line of sight ozone and wavelength dependent aerosol optical depths. language code: en);
change note: 2022-04-18 13:23:27.0 [tstevens] Insert Concept add broader relation (DIAS [7bdfc7f8-1fed-4b26-a256-fcaa585aeaf2,894381] - Spectrometers [055a79c7-61db-4250-abad-f1e09909f14c,885358]);
in scheme: instruments
definition: A solar tracking Direct beam Irradiance Airborne Spectrometer (DIAS) is used for calculation of line of sight ozone and wavelength dependent aerosol optical depths.

Spectrometers
type: Concept