SOIL WATER HOLDING CAPACITY
type: Concept
change note: 2017-03-10 09:25:26.0 [tstevens] update Definition (The percentage of water remaining in a soil two or three days after its having been saturated and after free drainage has practically ceased (field moisture capacity).); update Definition (The Nature and Properties of Soils, Prentice Hall, 1996. );
in scheme: sciencekeywords
definition: The percentage of water remaining in a soil two or three days after its having been saturated and after free drainage has practically ceased (field moisture capacity).

SOILS
type: Concept