TECTONIC LANDFORMS
type: Concept

VOLCANO
type: Concept
change note: 2013-08-16 10:27:16.0 [tbs1979] insert Definition (id: null text: A cone shaped mountain formed out of rock or ash thrown up from inside the earth, frequently with an opening or depression at the top. language code: en);
change note: 2013-08-05 13:56:00.0 [tbs1979] Insert Concept add broader relation (VOLCANO [7c2e1960-ae20-46a9-acf1-a3e71542fbb4,105391] - TECTONIC LANDFORMS [9673dc0b-89c0-4f0c-b378-f1c8cb267c8f,105291]);
in scheme: sciencekeywords
definition: A cone shaped mountain formed out of rock or ash thrown up from inside the earth, frequently with an opening or depression at the top.