CFOSAT
type: Concept
change note: 2019-12-19 09:13:09.0 [mmorahan] insert AltLabel (id: null category: primary text: Chinese-French Oceanography Satellite language code: en); insert Definition (id: null text: CFOSAT is a joint mission of the Chinese (CNSA) and French (CNES) space agencies with the goal to monitor the ocean surface winds and waves and to provide information on related ocean and atmospheric science and applications. The primary objective of CFOSAT is to monitor on a global scale the wind and waves at the ocean surface in order to improve: • The wind and wave forecast for marine meteorology (including severe events) • The ocean dynamics modeling and prediction • Our knowledge of climate variability • Fundamental knowledge on surface processes linked to wind and waves. An operational demonstration objective of CFOSAT is to provide observations over the ocean in near-real-time for assimilation in meteorological and wave forecast models. Wind and wave products must be available in operational centers within 3 hours after acquisition. CFOSAT will also be used to complement other satellite missions for the estimation of land surface parameters (in particular soil moisture and soil roughness), and polar ice sheet characteristics. language code: en); insert WeightedRelation (id: null related concept uuid: 55694771-4eee-455d-87db-135627949cf5 relationship type: null relationship value: null generated by: null); insert WeightedRelation (id: null related concept uuid: 1c7fb7a4-cedd-4328-b785-5b0774cf1990 relationship type: null relationship value: null generated by: null);
change note: 2019-12-19 09:10:27.0 [mmorahan] Insert Concept add broader relation (CFOSAT [7c3fab1c-d17e-4e5c-870e-994793c2594e,559573] - Earth Observation Satellites [3466eed1-2fbb-49bf-ab0b-dc08731d502b,541501]);
in scheme: platforms
definition: CFOSAT is a joint mission of the Chinese (CNSA) and French (CNES) space agencies with the goal to monitor the ocean surface winds and waves and to provide information on related ocean and atmospheric science and applications. The primary objective of CFOSAT is to monitor on a global scale the wind and waves at the ocean surface in order to improve: • The wind and wave forecast for marine meteorology (including severe events) • The ocean dynamics modeling and prediction • Our knowledge of climate variability • Fundamental knowledge on surface processes linked to wind and waves. An operational demonstration objective of CFOSAT is to provide observations over the ocean in near-real-time for assimilation in meteorological and wave forecast models. Wind and wave products must be available in operational centers within 3 hours after acquisition. CFOSAT will also be used to complement other satellite missions for the estimation of land surface parameters (in particular soil moisture and soil roughness), and polar ice sheet characteristics.

Earth Observation Satellites
type: Concept