Models
type: Concept

NCEP/DOE-R2M
type: Concept
in scheme: platforms
definition: NCEP-DOE Reanalysis 2 is an improved version of the NCEP Reanalysis I model that fixed errors and updated paramterizations of physical processes.
change note: 2015-08-10 14:51:16.0 [epneff] Added long name insert AltLabel (id: null text: NCEP/DOE Reanalysis 2 Model language code: en);
change note: 2015-08-10 14:50:49.0 [epneff] Insert Concept add broader relation (NCEP/DOE-R2M [7c4302ef-0fca-4987-9515-d059b9e0bb95,158239] - Models/Analyses [113ecbc2-ab36-4d58-a96c-a6ce0106e749,143215]);
change note: 2022-03-11 14:03:33.0 [tstevens] insert Definition (id: null text: NCEP-DOE Reanalysis 2 is an improved version of the NCEP Reanalysis I model that fixed errors and updated paramterizations of physical processes. language code: en);
change note: 2021-11-30 13:26:32.0 [tstevens] Move Concepts delete broader relation (null); add broader relation (NCEP/DOE-R2M [7c4302ef-0fca-4987-9515-d059b9e0bb95,826411] - Models [0a184cdc-c074-4946-90a6-02f03c686341,835911]);