NON-GOVERNMENT/NON-PROFIT ORGANIZATIONS
type: Concept

ECO/INFO
type: Concept
in scheme: providers
definition: The Inforain/Ecotrust center provides a network of information allowing users to achieve a deeper understanding of their local watersheds, estuaries and forests as well as a broader comprehension of these places within a bioregional context. The center compiles GIS data to create regional and community databases based on watershed boundaries. Data layers are available for download and interactive mapping applications provide functionality similar to that of sophisticated GIS software. Additional information available at "http://www.inforain.org/"