MANGROVE SWAMP
type: Concept
change note: 2016-06-13 13:43:40.0 [gee-cee] insert Definition (id: null text: Pertaining to tropical and subtropical swamps dominated by mangrove trees. language code: en);
change note: 2016-06-13 13:43:09.0 [gee-cee] Insert Concept add broader relation (MANGROVE SWAMP [7c666111-3297-474b-ba7b-c93db3a52cb0,188215] - COASTAL HABITAT [47be68db-d10d-43e7-b150-61cfd3f06126,84259]);
in scheme: sciencekeywords
definition: Pertaining to tropical and subtropical swamps dominated by mangrove trees.

COASTAL
type: Concept