UWI-MIL/GEOL
type: Concept
in scheme: providers
definition: University of Wisconsin System Mission Statement The mission of this system is to develop human resources, to discover and disseminate knowledge, to extend knowledge and its application beyond the boundaries of its campuses, and to serve and stimulate society by developing in students heightened intellectual, cultural, and humane sensitivities; scientific, professional, and technological expertise; and a sense of purpose.

ACADEMIC
type: Concept