COMMERCIAL
type: Concept

KKWDK
type: Concept
in scheme: providers
definition: Summary Provided By: http://translate.google.com/translate?hl=en&sl=de&u=http://www.digitale-kartografie.de/&sa=X&oi=translate&resnum=5&ct=result&prev=/search%3Fq%3D%2Bdigitale%2Bkartografie%26hl%3Den%26safe%3Doff%26client%3Dfirefox-a%26channel%3Ds%26rls%3Dorg.mozilla:en-US:official%26hs%3DvUD%26sa%3DG