DOD/USARMY/USACE/TEC
type: Concept
in scheme: providers
definition: The Topographic Engineering Center (TEC) mission is to provide the Warfighter with a superior knowledge of the battlefield, and support the Nation's civil and environmental initiatives through research, development, and the application of expertise in the topographic and related sciences. Website: "http://www.tec.army.mil/" [Summary provided by NOAA]

DOD
type: Concept