TECTONIC PROCESSES
type: Concept

TECTONIC UPLIFT
type: Concept
change note: 2013-08-16 12:11:34.0 [tbs1979] insert Definition (id: null text: A geological process most often caused by plate tectonics which increases elevation language code: en);
change note: 2013-08-05 14:00:56.0 [tbs1979] Insert Concept add broader relation (TECTONIC UPLIFT [7d5472ba-ae65-45df-a19a-c762055eaead,105417] - TECTONIC PROCESSES [99b4792a-9ea3-4756-a4dc-b1b30c946b54,86001]);
in scheme: sciencekeywords
definition: A geological process most often caused by plate tectonics which increases elevation