DOD/USARMY/USACE/SAM/MOBILE/OPJ/JALBTCX
type: Concept
change note: 2013-04-22 20:10:00.0 [saritz] Added long name. insert AltLabel (id: null text: Joint Airborne Lidar Bathymetry Technical Center of Expertise, Mobile District, South Atlantic Division, U.S. Army Corps of Engineers, U.S. Army, U.S. Department of Defense language code: en);
change note: 2012-10-01 15:53:06.0 [saritz] Insert Concept add broader relation (DOD/USARMY/USACE/SAM/MOBILE/OPJ/JALBTCX [7dff3980-7aaa-4db5-a49b-fe778d4935a2,40629] - DOD [9a3a209f-1d22-4a48-bbb2-dbfbca2959b1,24589]);
in scheme: providers
definition: The Joint Airborne Lidar Bathymetry Technical Center of Expertise (JALBTCX) mission is to perform operations, research, and development in airborne lidar bathymetry and complementary technologies to support the coastal mapping and charting requirements of the US Army Corps of Engineers (USACE), the US Naval Meteorology and Oceanography Command, and the National Oceanic and Atmospheric Administration (NOAA). JALBTCX staff includes engineers, scientists, hydrographers, and technicians from the USACE Mobile District, the Naval Oceanographic Office (NAVOCEANO), the USACE Engineer Research and Development Center (ERDC), and NOAA National Geodetic Survey.

DOD
type: Concept