DROUGHT INDICES
type: Concept

PALMER DROUGHT CROP MOISTURE INDEX
type: Concept
change note: 2012-07-12 14:21:12.0 [mpmorahan] update Definition (The Palmer Index was developed by Wayne Palmer in the 1960s and uses temperature and rainfall information in a formula to determine dryness. It has become the semi-official drought index. The Palmer Index is most effective in determining long term drought¿a matter of several months¿and is not as good with short-term forecasts (a matter of weeks). It uses a 0 as normal, and drought is shown in terms of minus numbers; for example, minus 2 is moderate drought, minus 3 is severe drought, and minus 4 is extreme drought. The Crop Moisture Index (CMI) is also a formula that was developed by Wayne Palmer subsequent to his development of the Palmer Drought Index. The CMI responds more rapidly than the Palmer Index and can change considerably from week to week, so it is more effective in calculating short-term abnormal dryness or wetness affecting agriculture. CMI is designed to indicate normal conditions at the beginning and end of the growing season; it uses the same levels as the Palmer Drought Index. It differs from the Palmer Index in that the formula places less weight on the data from previous weeks and more weight on the recent week.); update Definition (From: NOAA "http://www.drought.noaa.gov/palmer.html" See also: Palmer, W.C., 1968: Keeping track of moisture conditions, nationwide: The new crop moisture index, Weatherwise, 21, 156-161. );
change note: 2012-06-26 11:44:18.0 [gee-cee] Move Concepts delete broader relation (null); add broader relation (PALMER DROUGHT CROP MOISTURE INDEX [7e26f9e3-4c20-453d-bbc6-1970eca1ffb8,22601] - DROUGHT INDICES [f50672b3-13d8-4206-b6c9-a1f9891ea470,39837]);
change note: 2012-06-26 11:05:10.0 [gee-cee] Move Concepts add broader relation (PALMER DROUGHT CROP MOISTURE INDEX [7e26f9e3-4c20-453d-bbc6-1970eca1ffb8,22601] - LAND SURFACE/AGRICULTURE INDICATORS [112e71ec-c0a1-49a8-82d7-bcb317b45860,39835]); delete broader relation (null);
in scheme: sciencekeywords
definition: The Palmer Index was developed by Wayne Palmer in the 1960s and uses temperature and rainfall information in a formula to determine dryness. It has become the semi-official drought index. The Palmer Index is most effective in determining long term drought¿a matter of several months¿and is not as good with short-term forecasts (a matter of weeks). It uses a 0 as normal, and drought is shown in terms of minus numbers; for example, minus 2 is moderate drought, minus 3 is severe drought, and minus 4 is extreme drought. The Crop Moisture Index (CMI) is also a formula that was developed by Wayne Palmer subsequent to his development of the Palmer Drought Index. The CMI responds more rapidly than the Palmer Index and can change considerably from week to week, so it is more effective in calculating short-term abnormal dryness or wetness affecting agriculture. CMI is designed to indicate normal conditions at the beginning and end of the growing season; it uses the same levels as the Palmer Drought Index. It differs from the Palmer Index in that the formula places less weight on the data from previous weeks and more weight on the recent week.