COASTAL PROCESSES
type: Concept

BARRIER ISLANDS
type: Concept
in scheme: sciencekeywords
definition: Elongate sand bar formed parallel to the shore in areas of considerable sediment flux, but separated from shore by a lagoon, and pierced at intervals by inlets through which the sea communicates with lagoon and river.