RO3QET
type: Concept
change note: 2022-09-02 12:24:05.0 [sritz] insert Definition (id: null text: The primary scientific objective is to provide time/height ozone measurements from near the surface to the top of the troposphere to describe in high-fidelity their spatio-temporal distribution. These high-fidelity measurements will provide the GEO-CAPE science team with accurate representations of the PBL and FT ozone structure as proxies for the high time resolved observations from a geosynchronous satellite. With these observations of the detailed ozone structure, the GEO CAPE science team will be able to study the character of lower-atmospheric ozone and also assess the accuracy and vertical resolution with which a geosynchronous instrument could retrieve the observed laminar ozone structures. language code: en);
change note: 2022-09-02 12:19:55.0 [sritz] insert AltLabel (id: null category: primary text: Rocket-city O3 Quality Evaluation in the Troposphere language code: en);
change note: 2022-09-02 12:18:58.0 [sritz] Insert Concept add broader relation (RO3QET [7e3dbafa-6d45-4987-b244-329b72d44c6a,1040767] - Lidar/Laser Sounders [7c13f166-8711-4d2f-9251-4635002c6c31,1032463]);
in scheme: instruments
definition: The primary scientific objective is to provide time/height ozone measurements from near the surface to the top of the troposphere to describe in high-fidelity their spatio-temporal distribution. These high-fidelity measurements will provide the GEO-CAPE science team with accurate representations of the PBL and FT ozone structure as proxies for the high time resolved observations from a geosynchronous satellite. With these observations of the detailed ozone structure, the GEO CAPE science team will be able to study the character of lower-atmospheric ozone and also assess the accuracy and vertical resolution with which a geosynchronous instrument could retrieve the observed laminar ozone structures.

Lidar/Laser Sounders
type: Concept