A - C
type: Concept

AMPPOP
type: Concept
in scheme: projects
definition: AMPPoP aims to standardize the approaches for studying population dynamics, breeding and foraging activities of penguins all around the Antarctic continent so as to better understand the diverse population trends and relate them to climate change. http://classic.ipy.org/development/eoi/proposal-details.php?id=251