PRECIPITATION PROFILES
type: Concept

ICE WATER PATH
type: Concept
change note: 2020-05-20 13:34:25.0 [sritz] Insert Concept add broader relation (ICE WATER PATH [7ec9473a-0d08-4fb1-b2e8-b83d590d710c,560165] - PRECIPITATION PROFILES [d4449cf4-8d4e-4282-b84d-5098715389dd,368491]);
in scheme: sciencekeywords
definition: Total cloud ice in the atmospheric column