FOREST CONSERVATION
type: Concept
in scheme: sciencekeywords
definition: Management of the human use of the biosphere so that it may yield the greatest sustainable benefit to present generations while maintaining its potential to meet the needs and aspirations of future generations. It includes the preservation, maintenance, sustainable utilisation, restoration and enhancement of the environment.

FOREST SCIENCE
type: Concept