EC/NAVY/INOCAR
type: Concept
in scheme: providers
definition: Instituto Oceanografico de la Armada (INOCAR) is a National Oceanographic Data Center, in charge of gathering oceanographic cruise data, meteorological observations, the state of the sea, and bathymetry. Data are available on diskette, as well as listings, for the territorial Ecuadorian sea (the Southeast Pacific Ocean). Contact: INSTITUTO OCEANOGRAFICO DE LA ARMADA (INOCAR) Ave. 25 de Julio Base Naval Sur. P.O. Box 5940 Guayaquil, Ecuador Telephone: (593-4)431300 - (593-4)431816 Fax: (593-4)442151

ECUADOR
type: Concept