BOUNDARY LAYER TEMPERATURE
type: Concept
change note: 2013-09-05 09:44:50.0 [epneff] insert Definition (id: null text: In thermodynamics, the conversion of kinetic energy into heat by work done against the viscous stresses in the boundary layer. language code: en);
change note: 2013-10-16 19:02:27.0 [saritz] updated definition update Definition (Derived from Glossary of Meteorology, American Meteorological Society, 2013); update Definition (Air temperature measured within the the bottom layer (atmospheric boundary layer) of the troposphere that is in contact with the surface of the earth.);
change note: 2013-09-04 14:41:56.0 [epneff] Insert Concept add broader relation (BOUNDARY LAYER TEMPERATURE [7f94b0e5-edc6-4724-bd84-404896e09afe,105795] - UPPER AIR TEMPERATURE [926c1b80-6c11-40eb-ae7f-f5bcfdc43fac,85935]);
change note: 2013-09-05 09:45:28.0 [epneff] update Definition (EOSDIS V0 IMS Keyword Definitions.);
in scheme: sciencekeywords
definition: Air temperature measured within the the bottom layer (atmospheric boundary layer) of the troposphere that is in contact with the surface of the earth.

UPPER AIR TEMPERATURE
type: Concept