PHOTOMETERS
type: Concept
in scheme: instruments
definition: PHOTOMETERS are instruments used for measuring the luminance, luminous intensity, or luminance of a light source; similar to a radiometer, but with an output weighted by the wavelength response of the human eye.

Photometers
type: Concept