OCEAN SALINITY RECONSTRUCTION
type: Concept
in scheme: sciencekeywords
definition: Reconstruction of past ocean salinity based on paleoclimate proxy records.

PALEOCLIMATE RECONSTRUCTIONS
type: Concept