SPECIFIC HUMIDITY
type: Concept
change note: 2017-04-21 13:26:16.0 [sritz] insert Definition (id: null text: In a system of moist air, the (dimensionless) ratio of the mass of water vapor to the total mass of the system. language code: en);
change note: 2017-04-20 14:25:41.0 [sritz] Insert Concept add broader relation (SPECIFIC HUMIDITY [811391d2-4113-4d52-9c88-47d56afda481,278853] - HUMIDITY [427e5121-a142-41cb-a8e9-a70b7f98eb6a,84651]);
in scheme: sciencekeywords
definition: In a system of moist air, the (dimensionless) ratio of the mass of water vapor to the total mass of the system.

HUMIDITY
type: Concept