GeoTASO
type: Concept
definition: The Geostationary Trace gas and Aerosol Sensor Optimization (GeoTASO) and the GEO-CAPE Airborne Simulator (GCAS) instruments are pushbroom sensors capable of making remote sensing measurements of air quality and ocean color.
change note: 2020-08-12 15:34:09.0 [sritz] update Definition (The Geostationary Trace gas and Aerosol Sensor Optimization (GeoTASO) and the GEO-CAPE Airborne Simulator (GCAS) instruments are pushbroom sensors capable of making remote sensing measurements of air quality and ocean color.);
change note: 2020-08-12 15:32:42.0 [sritz] Insert Concept add broader relation (GeoTASO [81b0950f-2be5-44c2-8fa5-348a6da42326,560594] - Spectrometers/Radiometers [ecd58f82-8f96-45e1-9547-dd4a02291bd9,546159]);
change note: 2020-08-12 15:33:33.0 [sritz] insert AltLabel (id: null category: primary text: Geostationary Trace gas and Aerosol Sensor Optimization language code: en); insert Definition (id: null text: https://ui.adsabs.harvard.edu/abs/2016AGUFM.A34B..01N/abstract language code: en);
in scheme: instruments

Spectrometers/Radiometers
type: Concept