Temperature/Humidity Sensors
type: Concept

NOAA PSL Sea Snake
type: Concept
change note: 2023-03-13 17:27:04.0 [sritz] Insert Concept add broader relation (NOAA PSL Sea Snake [81c6c913-61e9-4324-92b0-d7617bdd1000,1246975] - Temperature/Humidity Sensors [bb5a51d9-0ded-40ed-9bfd-7cb0e788f1a5,1239017]);
change note: 2023-03-13 17:27:31.0 [sritz] insert AltLabel (id: null category: primary text: NOAA Physical Sciences Laboratory Sea Snake Thermometer language code: en);
change note: 2023-03-13 17:30:10.0 [sritz] insert Definition (id: null text: Floating “sea snake” thermometers measure the near-surface ocean temperature accurately and robustly within 0.1 m of the surface, where solar warming affects the ocean temperature. These temperature measurements are used to verify satellite sea surface temperature retrievals and to track the exchange of heat and moisture between the ocean and atmosphere. language code: en);
in scheme: instruments
definition: Floating “sea snake” thermometers measure the near-surface ocean temperature accurately and robustly within 0.1 m of the surface, where solar warming affects the ocean temperature. These temperature measurements are used to verify satellite sea surface temperature retrievals and to track the exchange of heat and moisture between the ocean and atmosphere.