UFL/GEOG
type: Concept
in scheme: providers
definition: Welcome to the Department of Geography at the University of Florida. The University is a top-ranked, Research One, land-grant university, and one of sixty-two member institutions of the exclusive Association of American Universities. The Department covers a range of topics in contemporary geography. Summary Provided By: http://www.geog.ufl.edu/

ACADEMIC
type: Concept