Galileo P
type: Concept
in scheme: instruments
change note: 2017-08-15 10:14:46.0 [tstevens] insert Definition (id: null text: Galileo is the European Union's Global Satellite Navigation System (GNSS). Sometimes called the ’European GPS‘, Galileo provides accurate positioning and timing information. Galileo is a programme under civilian control and its data can be used for a broad range of applications. It is autonomous but also interoperable with existing satellite navigation systems. At the moment, the Galileo constellation consists of 18 satellites. language code: en);
change note: 2017-08-15 07:41:37.0 [tstevens] update AltLabel (Europe's European Satellite Navigation System Payload);
change note: 2017-08-14 15:40:08.0 [tstevens] Insert Concept add broader relation (Galileo P [824e503e-5993-42f3-b7c6-dc6755c2060d,309971] - Galileo [bf71449f-834e-4183-9006-cf94f7eb5520,309955]);
change note: 2017-08-14 15:40:29.0 [tstevens] insert AltLabel (id: null category: primary text: Europe’s European Satellite Navigation System Payload language code: en);
change note: 2017-08-15 10:15:19.0 [tstevens] update Definition (Galileo is the European Union's Global Satellite Navigation System (GNSS). Sometimes called the 'European GPS', Galileo provides accurate positioning and timing information. Galileo is a programme under civilian control and its data can be used for a broad range of applications. It is autonomous but also interoperable with existing satellite navigation systems. At the moment, the Galileo constellation consists of 18 satellites.);
definition: Galileo is the European Union's Global Satellite Navigation System (GNSS). Sometimes called the 'European GPS', Galileo provides accurate positioning and timing information. Galileo is a programme under civilian control and its data can be used for a broad range of applications. It is autonomous but also interoperable with existing satellite navigation systems. At the moment, the Galileo constellation consists of 18 satellites.

Galileo
type: Concept