Applanix
type: Concept
change note: 2020-08-12 15:37:00.0 [sritz] insert AltLabel (id: null category: primary text: Applanix POSAV language code: en); insert Definition (id: null text: POS AV is a hardware and software system specifically designed for Direct Georeferencing of airborne sensor data. By integrating precision GNSS with inertial technology, POS AV enables geospatial projects to be completed more efficiently, effectively, and economically. Supported by Applanix' industry expertise and technological innovation, POS AV is engineered for aerial cameras, scanning lasers, imaging sensors, synthetic aperture radar, and LIDAR technology. language code: en);
change note: 2020-08-12 15:35:53.0 [sritz] Insert Concept add broader relation (Applanix [8315215c-1aa2-4f06-b003-3bb6339b33a4,560596] - Positioning/Navigation [596a5700-b3fd-4261-b8f8-a054d052e3fe,544177]);
in scheme: instruments
definition: POS AV is a hardware and software system specifically designed for Direct Georeferencing of airborne sensor data. By integrating precision GNSS with inertial technology, POS AV enables geospatial projects to be completed more efficiently, effectively, and economically. Supported by Applanix' industry expertise and technological innovation, POS AV is engineered for aerial cameras, scanning lasers, imaging sensors, synthetic aperture radar, and LIDAR technology.

Positioning/Navigation
type: Concept