HYDROGEN GAS
type: Concept

HYDROGEN GAS VERTICAL/GEOGRAPHIC DISTRIBUTION
type: Concept
change note: 2013-03-11 12:36:18.0 [tbs1979] update Definition (The vertical and geographic distribution of hydrogen gas within the solid Earth.);
change note: 2013-03-11 12:35:25.0 [tbs1979] insert Definition (id: null text: The vertical and geographic distribution of natural gas within the solid Earth. language code: en);
change note: 2013-03-05 10:14:24.0 [tbs1979] Insert Concept add broader relation (HYDROGEN GAS VERTICAL/GEOGRAPHIC DISTRIBUTION [833b6958-fc93-473c-aadb-bb65da7578e5,82911] - HYDROGEN GAS [96bbae63-81c1-43b4-90f0-52731e2b52ca,82907]);
in scheme: sciencekeywords
definition: The vertical and geographic distribution of hydrogen gas within the solid Earth.