Grabbers/Traps/Collectors
type: Concept

SEDIMENT METERS
type: Concept
in scheme: instruments
definition: An instrument used for measuring a quantity of sediment in the water. Group: Instrument_Details Entry_ID: SEDIMENT METERS Group: Instrument_Identification Instrument_Category: In Situ/Laboratory Instruments Instrument_Class: Samplers Instrument_Type: Grabbers/Traps/Collectors Short_Name: SEDIMENT METERS End_Group Creation_Date: 2010-08-31 End_Group