CHAIN DEFINITION SERVICES
type: Concept
in scheme: sciencekeywords
definition: Services to define a service chain and enable it to be executed by the workflow enactment service; may also provide a chain validation service. This is also known as Web Service Chaining.

DATA APPLICATION SERVICES
type: Concept