MACROFAUNA
type: Concept
in scheme: sciencekeywords
definition: "Macrobiota" is a general term for the larger soil organisms. Macrofauna, in particular, refers to burrowing vertebrate animals, but may include larger insects and earhworms.

SOILS
type: Concept