Models
type: Concept

WRF-Chem
type: Concept
definition: The Weather Research and Forecasting (WRF) Model is a next-generation mesoscale numerical weather prediction system designed for both atmospheric research and operational forecasting applications. It features two dynamical cores, a data assimilation system, and a software architecture supporting parallel computation and system extensibility. The model serves a wide range of meteorological applications across scales from tens of meters to thousands of kilometers. The effort to develop WRF began in the latter 1990's and was a collaborative partnership of the National Center for Atmospheric Research (NCAR), the National Oceanic and Atmospheric Administration (represented by the National Centers for Environmental Prediction (NCEP) and the Earth System Research Laboratory), the U.S. Air Force, the Naval Research Laboratory, the University of Oklahoma, and the Federal Aviation Administration (FAA). The WRF-Chem model is now released as part of the Weather Research and Forecasting (WRF) modeling package.
in scheme: platforms
change note: 2022-08-16 12:24:22.0 [tstevens] insert AltLabel (id: null category: primary text: Weather Research and Forecasting Model Coupled to Chemistry language code: en); insert Definition (id: null text: language code: en);
change note: 2022-08-16 12:22:12.0 [tstevens] Insert Concept add broader relation (WRF-Chem [83ed16e1-71b9-4c2b-9184-b517be58f421,1026072] - Models [0a184cdc-c074-4946-90a6-02f03c686341,1015890]);
change note: 2022-08-16 12:26:56.0 [tstevens] update Definition (The Weather Research and Forecasting (WRF) Model is a next-generation mesoscale numerical weather prediction system designed for both atmospheric research and operational forecasting applications. It features two dynamical cores, a data assimilation system, and a software architecture supporting parallel computation and system extensibility. The model serves a wide range of meteorological applications across scales from tens of meters to thousands of kilometers. The effort to develop WRF began in the latter 1990's and was a collaborative partnership of the National Center for Atmospheric Research (NCAR), the National Oceanic and Atmospheric Administration (represented by the National Centers for Environmental Prediction (NCEP) and the Earth System Research Laboratory), the U.S. Air Force, the Naval Research Laboratory, the University of Oklahoma, and the Federal Aviation Administration (FAA). The WRF-Chem model is now released as part of the Weather Research and Forecasting (WRF) modeling package.);
change note: 2022-08-16 12:25:40.0 [tstevens] update Definition (The Weather Research and Forecasting (WRF) Model is a next-generation mesoscale numerical weather prediction system designed for both atmospheric research and operational forecasting applications. It features two dynamical cores, a data assimilation system, and a software architecture supporting parallel computation and system extensibility. The model serves a wide range of meteorological applications across scales from tens of meters to thousands of kilometers. The effort to develop WRF began in the latter 1990's and was a collaborative partnership of the National Center for Atmospheric Research (NCAR), the National Oceanic and Atmospheric Administration (represented by the National Centers for Environmental Prediction (NCEP) and the Earth System Research Laboratory), the U.S. Air Force, the Naval Research Laboratory, the University of Oklahoma, and the Federal Aviation Administration (FAA).);