UWA/SAFS/UWFC
type: Concept
in scheme: providers
definition: he University of Washington Fish Collection is a state-supported facility of the School of Aquatic and Fishery Sciences, located on the University of Washington campus in Seattle, Washington, USA. UWFC News: * The UW Fish Collection is now part of the Burke Museum of Natural History and Culture! Click Here to learn more about the Burke. * Collection now contains 7,252,455 specimens of eggs and larvae and 311,337 adult specimens in 123,981 lots * Search collection Summary Provided By: http://artedi.fish.washington.edu/

ACADEMIC
type: Concept