NMTECH/EES
type: Concept
in scheme: providers
definition: The Earth and Environmental Science Department offers BS, MS, and PhD degrees in a broad range of earth science disciplines including geology, geochemistry, geophysics, and hydrology, and administers an interdisciplinary undergraduate course of study in environmental science. The geology, geochemistry, hydrology, and geophysics programs operate semi-autonomously under the umbrella of the E & ES Department; however, one of the great strengths of the department is the large number of research and teaching efforts that cross program boundaries. Website: "http://www.ees.nmt.edu/" [Summary provided by New Mexico Institute of Mining and Technology.]

ACADEMIC
type: Concept