SURFACE WATER PROCESSES/MEASUREMENTS
type: Concept

WATER PRESSURE
type: Concept
change note: 2016-04-04 09:39:35.0 [gee-cee] update Definition (Pertaining to the measurement of force per unit area exerted on water by the overlying column of water.); update Definition (Goudie, Andrew. 1997. The Encyclopedic Dictionary of Physical Geography. Blackwell Publishing, Malden, Massachusetts. );
change note: 2016-03-31 08:14:35.0 [gee-cee] Move Concepts delete broader relation (null); add broader relation (WATER PRESSURE [84784fef-5b76-45a0-91e0-28788e09fea6,85587] - SURFACE WATER PROCESSES/MEASUREMENTS [9d86cd70-062a-4c39-b3f3-226abebc07f7,158723]);
in scheme: sciencekeywords
definition: Pertaining to the measurement of force per unit area exerted on water by the overlying column of water.