LSU/WHOCC
type: Concept
in scheme: providers
definition: The mission of the World Health Organization Collaborating Center for Remote Sensing and Geographic Information Systems for Public Health is to provide expertise in zoonotic disease surveillance with an ability in GIS & remote sensing. Unfortunately this generated certain problems in Geneva which were eased by rotating our stated priorities. Since that time we have absorbed key GIS & RS units in the university into the center to provide that expertise in its many scientific dimensions and technological complexities. Website: "http://www.vetmed.lsu.edu/whocc/" [Summary provided by Louisiana State University.]

ACADEMIC
type: Concept