WILDFIRES
type: Concept
in scheme: sciencekeywords
definition: An uncontrollable fire initially caused by humans or nature. A Wildfire Advisory may report on wildfires occurring in a particular region.

FIRE ADVISORIES
type: Concept