LAND RECORDS
type: Concept

SEDIMENTS
type: Concept
in scheme: sciencekeywords
definition: Unconsolidated particles created by the weathering and erosion of rock, by chemical precipitation from solution in water, or from the secretions of organisms, and transported by water, wind, or glaciers.