NOAA
type: Concept

DOC/NOAA/OAR/ESRL/GMD/OZWV
type: Concept
change note: 2017-03-10 15:18:34.0 [tstevens] insert AltLabel (id: null text: Ozone and Water Vapor Group language code: en);
change note: 2017-03-10 15:20:47.0 [tstevens] update Definition (The Ozone and Water Vapor Group conducts research on the nature and causes of the depletion of the stratospheric ozone layer and the role of stratospheric and tropospheric ozone and water vapor in forcing climate change and in modifying the chemical cleansing capacity of the atmosphere. This mission is accomplished through long-term observations and intensive field programs that measure total column ozone, ozone vertical profiles (ozonesondes and umkehrs), ground level ozone, and water vapor vertical profiles in the upper troposphere and stratosphere. https://www.esrl.noaa.gov/gmd/ozwv/);
change note: 2017-03-10 15:21:42.0 [tstevens] update Definition (The Ozone and Water Vapor Group conducts research on the nature and causes of the depletion of the stratospheric ozone layer and the role of stratospheric and tropospheric ozone and water vapor in forcing climate change and in modifying the chemical cleansing capacity of the atmosphere. This mission is accomplished through long-term observations and intensive field programs that measure total column ozone, ozone vertical profiles (ozonesondes and umkehrs), ground level ozone, and water vapor vertical profiles in the upper troposphere and stratosphere. https://www.esrl.noaa.gov/gmd/ozwv/);
change note: 2017-03-10 15:19:26.0 [tstevens] insert Definition (id: null text: The Ozone and Water Vapor Group conducts research on the nature and causes of the depletion of the stratospheric ozone layer and the role of stratospheric and tropospheric ozone and water vapor in forcing climate change and in modifying the chemical cleansing capacity of the atmosphere. This mission is accomplished through long-term observations and intensive field programs that measure total column ozone, ozone vertical profiles (ozonesondes and umkehrs), ground level ozone, and water vapor vertical profiles in the upper troposphere and stratosphere. language code: en);
change note: 2017-03-10 15:17:13.0 [tstevens] Insert Concept add broader relation (DOC/NOAA/OAR/ESRL/GMD/OZWV [85aa1472-e29b-4a87-9b44-a2815e7987c2,278689] - NOAA [c9003d36-020d-4e86-995a-498945576c23,249099]);
definition: The Ozone and Water Vapor Group conducts research on the nature and causes of the depletion of the stratospheric ozone layer and the role of stratospheric and tropospheric ozone and water vapor in forcing climate change and in modifying the chemical cleansing capacity of the atmosphere. This mission is accomplished through long-term observations and intensive field programs that measure total column ozone, ozone vertical profiles (ozonesondes and umkehrs), ground level ozone, and water vapor vertical profiles in the upper troposphere and stratosphere.
in scheme: providers