MULTINATIONAL ORGANIZATIONS
type: Concept

EEA/NATURE
type: Concept
in scheme: providers
definition: The regulation establishing the EEA was adopted by the European Union in 1990. It came into force in late 1993 immediately after the decision was taken to locate the EEA in Copenhagen. Work started in earnest in 1994. The regulation also established the European environment information and observation network (Eionet). EEA's mandate is: * To help the Community and member countries make informed decisions about improving the environment, integrating environmental considerations into economic policies and moving towards sustainability * To coordinate the European environment information and observation network (Eionet) Main clients are the European Union institutions — the European Commission, the European Parliament, the Council — and our member countries. In addition to this central group of European policy actors, we also serve other EU institutions such as the Economic and Social Committee and the Committee of the Regions. The business community, academia, non-governmental organisations and other parts of civil society are also important users of our information. We try to achieve two-way communication with our clients in order to correctly identify their information needs, and make sure that the information provided is understood and taken up by them. Summary provided by http://www.eea.europa.eu/