SALT MARSH
type: Concept
change note: 2013-03-29 10:36:20.0 [tbs1979] insert Definition (id: null text: An environment in the upper coastal intertidal zone between land and salty or brackish water, dominated by dense stands of halophytic (salt-tolerant) plants such as herbs, grasses, or low shrubs. language code: en);
change note: 2013-02-18 14:16:55.0 [tbs1979] Insert Concept add broader relation (SALT MARSH [85f409fd-9d81-4cac-84ed-fb0bb4599924,82607] - COASTAL LANDFORMS [c58320e6-3f1d-4c36-9bee-6bad73404c21,62739]);
in scheme: sciencekeywords
definition: An environment in the upper coastal intertidal zone between land and salty or brackish water, dominated by dense stands of halophytic (salt-tolerant) plants such as herbs, grasses, or low shrubs.

COASTAL LANDFORMS
type: Concept