AMPR
type: Concept
change note: 2019-10-09 11:18:39.0 [sritz] update Definition (The AMPR is a total power passive microwave radiometer producing calibrated brightness temperatures (TB) at 10.7, 19.35, 37.1, and 85.5 GHz. These frequencies are sensitive to the emission and scattering of precipitation-size ice, liquid water, and water vapor. The AMPR performs a 90º cross-track data scan perpendicular to the direction of aircraft motion. It processes a linear polarization feed with full vertical polarization at -45º and full horizontal polarization at +45º, with the polarization across the scan mixed as a function of sin2, giving an equal V-H mixture at 0º (aircraft nadir). A full calibration is made every fifth scan using hot and cold blackbodies. From a typical ER-2 flight altitude of ~20 km, surface footprint sizes range from 640 m (85.5 GHz) to 2.8 km (10.7 GHz). All four channels share a common measurement grid with collocated footprint centers, resulting in over-sampling of the low frequency channels with respect to 85.5 GHz. Additional Information: https://airbornescience.nasa.gov/instrument/AMPR [Source: NASA]); update Definition (https://airbornescience.nasa.gov/instrument/AMPR);
in scheme: instruments
definition: The AMPR is a total power passive microwave radiometer producing calibrated brightness temperatures (TB) at 10.7, 19.35, 37.1, and 85.5 GHz. These frequencies are sensitive to the emission and scattering of precipitation-size ice, liquid water, and water vapor. The AMPR performs a 90º cross-track data scan perpendicular to the direction of aircraft motion. It processes a linear polarization feed with full vertical polarization at -45º and full horizontal polarization at +45º, with the polarization across the scan mixed as a function of sin2, giving an equal V-H mixture at 0º (aircraft nadir). A full calibration is made every fifth scan using hot and cold blackbodies. From a typical ER-2 flight altitude of ~20 km, surface footprint sizes range from 640 m (85.5 GHz) to 2.8 km (10.7 GHz). All four channels share a common measurement grid with collocated footprint centers, resulting in over-sampling of the low frequency channels with respect to 85.5 GHz. Additional Information: https://airbornescience.nasa.gov/instrument/AMPR [Source: NASA]

Radiometers
type: Concept