ACADEMIC
type: Concept

UTX-AUSTIN/ARL
type: Concept
in scheme: providers
definition: he Applied Research Laboratories of The University of Texas at Austin (ARL:UT) is a research unit that has been associated with the university since 1946. Throughout its 60 year history, ARL has been engaged in a sponsored research program dedicated to improving our nation’s military capability in applications of acoustics, electromagnetics, and information technology. As an organized research unit reporting to the Vice President for Research, ARL supports the three traditional roles of a major university: research, education, and public service. Summary Provided By: http://www.arlut.utexas.edu/about/index.html