FADS
type: Concept
in scheme: projects
definition: The Florida Acid Deposition Study (FADS) network began operations in mid-1981 and ended in August 1985. The goal was to better understand the relationship between power plant emissions and environmental quality.

D - F
type: Concept