IA-STATE/CA/AGRON
type: Concept
in scheme: providers
definition: Agronomy at ISU offers undergraduate programs that lead to degrees in five areas of emphasis ranging from agroecology to business to biotechnology. M.S. and Ph.D. programs are available in agricultural meteorology, agronomy (M.S. only), crop production and physiology, plant breeding, and six areas of specialization within soil science. Summary Provided By: http://www.agron.iastate.edu/about/index.aspx

ACADEMIC
type: Concept