VRIJE-B/CHEM/ANCH
type: Concept
in scheme: providers
definition: race metal biogeochemistry in riverine, estuarine and marine systems * Ultra-clean sampling, storage and analyses techniques. * Determination of trace metals in organisms, plants, sediments, air, water. * Spatial and seasonal variations in the transport of trace metals. * Biogeochemical cycles of trace elements * Marine barium biogeochemistry * Trace, minor and major elements in non-organic biogenic substrates as tracers of environmental changes (shells of bivalves and calcareous sponges) Information provided by http://www.vub.ac.be/ANCH/research.html

ACADEMIC
type: Concept