DATA ACCESS/RETRIEVAL
type: Concept
change note: 2020-05-21 11:29:40.0 [tstevens] Rename Concept update PrefLabel (DATA ACCESS/RETRIEVAL);
in scheme: sciencekeywords
definition: Services that provide online capabilities for searching (typically through a user-friendly web-based search engine) to locate and retrieve (directdownloading or ordering) scientific data sets from databases or archives.

DATA MANAGEMENT/DATA HANDLING
type: Concept