U-SYDNEY/COLEO
type: Concept
in scheme: providers
definition: COLEO's information is useful for Taxonomists, Collectors and Naturalists, Locality Search, Rearing beetles, info about Listservers, searchengines, Online keys and more Website:http://www.coleoptera.org/ Info: Coleoptera

ACADEMIC
type: Concept