COASTAL PROCESSES
type: Concept

SALTATION
type: Concept
change note: 2013-03-29 13:03:38.0 [tbs1979] insert Definition (id: null text: A specific type of particle transport by fluids such as wind, or the denser fluid water. It occurs when loose material is removed from a bed and carried by the fluid, before being transported back to the surface. language code: en);
change note: 2013-02-18 14:57:40.0 [tbs1979] Insert Concept add broader relation (SALTATION [872459ca-da1e-448f-9bf4-383b628f4609,82651] - COASTAL PROCESSES [672d6958-4bbc-4b33-adc8-927e4348908b,82553]);
in scheme: sciencekeywords
definition: A specific type of particle transport by fluids such as wind, or the denser fluid water. It occurs when loose material is removed from a bed and carried by the fluid, before being transported back to the surface.